Forums

Home » Liferay IDE » English

Combination View Flat View Tree View
Threads [ Previous | Next ]
toggle
kaleem ansari
error in ANT build path
April 21, 2013 10:16 PM
Answer

kaleem ansari

Rank: New Member

Posts: 21

Join Date: March 23, 2013

Recent Posts

while deploying the sdk build.xml file build fails below is the error


BUILD FAILED
E:\tlwsoft\tlwgivensoft\liferay-plugins-sdk-6.1.1\liferay-plugins-sdk-6.1.1\build.xml:10: The following error occurred while executing this line:
E:\tlwsoft\tlwgivensoft\liferay-plugins-sdk-6.1.1\liferay-plugins-sdk-6.1.1\build.xml:46: The following error occurred while executing this line:
E:\tlwsoft\tlwgivensoft\liferay-plugins-sdk-6.1.1\liferay-plugins-sdk-6.1.1\build-common-plugins.xml:30: The following error occurred while executing this line:
E:\tlwsoft\tlwgivensoft\liferay-plugins-sdk-6.1.1\liferay-plugins-sdk-6.1.1\build-common-plugins.xml:75: The following error occurred while executing this line:
E:\tlwsoft\tlwgivensoft\liferay-plugins-sdk-6.1.1\liferay-plugins-sdk-6.1.1\build-common-plugins.xml:86: The following error occurred while executing this line:
E:\tlwsoft\tlwgivensoft\liferay-plugins-sdk-6.1.1\liferay-plugins-sdk-6.1.1\build-common-plugins.xml:36: The following error occurred while executing this line:
java.io.FileNotFoundException: E:\tlwsoft\tlwgivensoft\liferay-plugins-sdk-6.1.1\liferay-plugins-sdk-6.1.1\portlets\teachweblearn-portlet\build.xml (The system cannot find the file specified)


plz send me the reply as soon as possible
Gregory Amerson
RE: error in ANT build path
April 21, 2013 10:33 PM
Answer

Gregory Amerson

LIFERAY STAFF

Rank: Liferay Master

Posts: 929

Join Date: February 16, 2010

Recent Posts

Hello Kaleem,

Can you provide us with a set of steps that you are using to get this error? Also can you attach a sample project that demostrates this error? Thanks!
Manish Yadav
RE: error in ANT build path
April 21, 2013 11:05 PM
Answer

Manish Yadav

Rank: Expert

Posts: 384

Join Date: May 26, 2012

Recent Posts

Hi Kaleem,

Please check first teachweblearn-portlet portlet in inside directory :- liferay-plugins-sdk-6.1.1/portlets
Second You can try build from command prompt.

liferay-plugins-sdk-6.1.1/portlets/teachweblearn-portlet>ant deploy teachweblearn-portlet